Facility Ontology
type: Ontology
version IRI: FacilityOntology
rights: CUBRC Inc., see full license.
comment: This ontology is designed to represent buildings and campuses that are designed to serve some specific purpose and which are common to multiple domains.
version info: Version 2.0

Church
type: Class
subclass of: Religious Facility
definition: A Religious Facility that is designed for Christian worship and prayer.
ont00001754: https://en.wikipedia.org/wiki/Church_(building)
ont00001760: Facility Ontology

Grocery Store
type: Class
subclass of: Commercial Facility
definition: A Commercial Facility that is designed to sell food.
ont00001754: https://en.wikipedia.org/w/index.php
ont00001760: Facility Ontology

Hostel
type: Class
subclass of: Residential Facility
definition: A Residential Facility that is designed to temporarily lodge guests in a sociable environment for relatively low costs.
ont00001754: https://en.wikipedia.org/w/index.php
ont00001760: Facility Ontology

Petroleum Depot
type: Class
subclass of: Storage Facility
definition: A Storage Facility that is designed to store petroleum, oil, or lubricants.
ont00001760: Facility Ontology

Religious Facility
type: Class
subclass of: ont00000192
definition: A Facility that is designed for worship and prayer.
ont00001754: https://en.wikipedia.org/w/index.php
ont00001760: Facility Ontology

Healthcare Facility
type: Class
subclass of: ont00000192
definition: A Facility that is designed for the diagnosis, treatment, and prevention of disease.
ont00001754: https://en.wikipedia.org/w/index.php
ont00001760: Facility Ontology

Open Pit Mine
type: Class
subclass of: Mine
definition: A Mine that is designed to support the extraction of materials from the ground directly without using tunnels.
ont00001754: https://en.wikipedia.org/w/index.php
ont00001760: Facility Ontology

Seat of National Government
type: Class
subclass of: Government Building
definition: A Government Building that is designed for the administration of a sovereign nation.
example: Parliament of Canada
example: United States Capitol
ont00001754: https://en.wikipedia.org/w/index.php
ont00001760: Facility Ontology

Underwater Mine
type: Class
subclass of: Mine
definition: A Mine that is designed to support the extraction of materials from the ocean floor.
ont00001754: https://en.wikipedia.org/w/index.php
ont00001760: Facility Ontology

Rail Facility
type: Class
subclass of: Transportation Facility
definition: A Transportation Facility that is designed for transferring people or cargo to and from Trains.
ont00001754: https://en.wikipedia.org/w/index.php
ont00001760: Facility Ontology

Base of Operations
type: Class
subclass of: Military Base
alternative label: Main Operating Base
definition: A Military Base with permanently stationed operating forces, robust Infrastructure, and strengthened force protection measures such that it is designed to launch and support large-scale operations, support smaller or less-permanent bases, and organize supply facilities.
ont00001753: MOB
ont00001754: http://www.jcs.mil/Portals/36/Documents/Doctrine/pubs/dictionary.pdf
ont00001760: Facility Ontology

Hotel
type: Class
subclass of: Residential Facility
definition: A Residential Facility that is designed to provide lodging that is paid for on a short-term basis.
ont00001754: https://en.wikipedia.org/w/index.php
ont00001760: Facility Ontology

Heliport
type: Class
subclass of: Airport
definition: An Airport that is designed for launching, receiving, and housing Rotorcraft.
ont00001754: https://en.wikipedia.org/w/index.php
ont00001760: Facility Ontology

Ammunition Depot
type: Class
subclass of: Storage Facility
definition: A Storage Facility that is designed to store Portions of Ammunition.
ont00001754: https://en.wikipedia.org/w/index.php
ont00001760: Facility Ontology

Transportation Facility
type: Class
subclass of: ont00000192
definition: A Facility that is designed for commencing or concluding the transportation of transportation artifacts, or for housing transportation artifacts.
ont00001754: https://en.wikipedia.org/w/index.php
ont00001760: Facility Ontology

Pumping Station
type: Class
subclass of: Product Transport Facility
definition: A Product Transport Facility that is designed to pump fluids from one place to another.
ont00001754: https://en.wikipedia.org/w/index.php
ont00001760: Facility Ontology

Petroleum Manufacturing Facility
type: Class
subclass of: Factory
definition: A Factory that is designed to manufacture petroleum-based products.
ont00001754: https://en.wikipedia.org/w/index.php
ont00001760: Facility Ontology

Chemical Manufacturing Facility
type: Class
subclass of: Factory
definition: A Factory that is designed to manufacture or process chemicals.
ont00001754: https://en.wikipedia.org/w/index.php
ont00001760: Facility Ontology

Shop
type: Class
subclass of: Commercial Facility
definition: A Commercial Facility designed to sell small lots of goods to consumers.
ont00001754: https://en.wikipedia.org/w/index.php
ont00001760: Facility Ontology

Educational Facility
type: Class
subclass of: ont00000192
definition: A Facility that is designed for facilitating learning, or the acquisition of knowledge, skills, values, beliefs, and habits.
ont00001754: https://en.wikipedia.org/w/index.php
ont00001760: Facility Ontology

Underground Mine
type: Class
subclass of: Mine
definition: A Mine that is designed to support the extraction of materials from the ground using underground tunnels and shafts.
ont00001754: https://en.wikipedia.org/wiki/Underground_mining_(hard_rock)
ont00001760: Facility Ontology

Thermal Power Plant
type: Class
subclass of: Electric Power Station
definition: An Electric Power Station that is designed to convert heat energy into electrical energy.
ont00001754: https://en.wikipedia.org/w/index.php
ont00001760: Facility Ontology

House
type: Class
subclass of: Residential Facility
definition: A Residential Facility that is designed to provide a self-standing, permanent residence for an individual, family, household, multiple families, or similar-sized group.
ont00001754: https://en.wikipedia.org/w/index.php
ont00001760: Facility Ontology

Training Camp
type: Class
subclass of: ont00000192
definition: A Facility that is designed for rigorous and focused training in order to learn or improve skills, usually involving physical actions.
ont00001754: https://en.wikipedia.org/w/index.php
ont00001760: Facility Ontology

Apartment Building
type: Class
subclass of: Residential Facility
definition: A Residential Facility that is designed to contain multiple permanent residences comprised of a suite of rooms.
ont00001754: https://en.wikipedia.org/w/index.php
ont00001760: Facility Ontology

Agricultural Facility
type: Class
subclass of: ont00000192
definition: A Facility that is designed as a building or campus for agricultural processes with the aim of cultivating animals, plants, or fungi for food, fiber, biofuel, medicinal plants, or other products to sustain and enhance human life.
ont00001754: https://en.wikipedia.org/w/index.php
ont00001760: Facility Ontology

Police Station
type: Class
subclass of: Public Safety Facility
definition: A Public Safety Facility that is designed for the professional and clerical processes of a local police force.
ont00001754: https://en.wikipedia.org/w/index.php
ont00001760: Facility Ontology

Warehouse
type: Class
subclass of: Storage Facility
definition: A Storage Facility that is designed to store commercial goods.
ont00001754: https://en.wikipedia.org/w/index.php
ont00001760: Facility Ontology

Weapon Manufacturing Facility
type: Class
subclass of: Factory
definition: A Factory that is designed to produce or assemble weapons.
ont00001754: https://en.wikipedia.org/w/index.php
ont00001760: Facility Ontology

Residential Facility
type: Class
subclass of: ont00000192
definition: A Facility that is designed to house one or more Persons.
ont00001754: https://en.wikipedia.org/w/index.php
ont00001760: Facility Ontology

Nuclear Power Plant
type: Class
subclass of: Thermal Power Plant
definition: A Thermal Power Plant that is designed to produce heat by means of a nuclear reactor, which is then converted to electrical energy.
ont00001754: https://en.wikipedia.org/w/index.php
ont00001760: Facility Ontology

Motor Vehicle Manufacturing Facility
type: Class
subclass of: Factory
definition: A Factory that is designed to manufacture automobiles.
ont00001754: https://en.wikipedia.org/w/index.php
ont00001760: Facility Ontology

Missile Launch Site
type: Class
subclass of: Military Facility
definition: A Military Facility that is designed for storing and launching missiles.
ont00001754: https://en.wikipedia.org/w/index.php
ont00001760: Facility Ontology

Office Building
type: Class
subclass of: Commercial Facility
definition: A Commercial Facility that is designed as an environment for conducting commercial, professional, or bureaucratic work.
ont00001754: https://en.wikipedia.org/w/index.php
ont00001760: Facility Ontology

Public Safety Facility
type: Class
subclass of: ont00000192
definition: A Facility that is designed for the prevention of and protection from events that could endanger, injure, or damage the general public.
ont00001754: https://en.wikipedia.org/w/index.php
ont00001760: Facility Ontology

Military Base
type: Class
subclass of: Military Facility
definition: A Military Facility that is designed to shelter military equipment and personnel and to facilitate training and operations.
ont00001754: https://en.wikipedia.org/w/index.php
ont00001760: Facility Ontology

Mosque
type: Class
subclass of: Religious Facility
definition: A Religious Facility that is designed for Islamic worship and prayer.
ont00001754: https://en.wikipedia.org/w/index.php
ont00001760: Facility Ontology

Communications Facility
type: Class
subclass of: ont00000192
definition: A Facility that is designed to support processes of receiving or transmitting information.
ont00001760: Facility Ontology

Seat of Local Government
type: Class
subclass of: Government Building
alternative label: City Hall
alternative label: Town Hall
definition: A Government Building that is designed for the administration of a local community.
ont00001754: https://en.wikipedia.org/w/index.php
ont00001760: Facility Ontology

Motel
type: Class
subclass of: Hotel
definition: A Hotel that is designed to accommodate motor vehicles along with their occupants.
ont00001754: https://en.wikipedia.org/w/index.php
ont00001760: Facility Ontology

Mine
type: Class
subclass of: ont00000192
definition: A Facility that is designed to support the extraction of minerals or other geological materials from an orebody, lode, vein, seam, reef, or placer deposit within the earth.
ont00001754: https://en.wikipedia.org/w/index.php
ont00001760: Facility Ontology

Entertainment Facility
type: Class
subclass of: ont00000192
definition: A Facility that is designed to host activities that are intended to hold the interest of, or give pleasure or delight to, an audience.
ont00001754: https://en.wikipedia.org/w/index.php
ont00001760: Facility Ontology

Mailing Facility
type: Class
subclass of: ont00000192
definition: A Facility that is designed for the systematic physical transportation of documents and packages.
ont00001754: https://en.wikipedia.org/w/index.php
ont00001760: Facility Ontology

Radio Relay Station
type: Class
subclass of: Communications Facility
definition: A Communications Facility that is designed to support the receiving and re-transmitting of radio signals.
ont00001760: Facility Ontology

Combat Outpost
type: Class
subclass of: Military Facility
definition: A Military Facility that is designed to support the conduction of combat operations of limited scope or size.
ont00001754: https://en.wikipedia.org/wiki/Outpost_(military)
ont00001760: Facility Ontology

Distribution Port
type: Class
subclass of: Port
definition: A Port that is designed with the cargo handling equipment necessary for the loading and unloading of Watercraft
ont00001754: https://en.wikipedia.org/w/index.php
ont00001760: Facility Ontology

Product Transport Facility
type: Class
subclass of: ont00000192
definition: A Facility that is designed to transport some product.
ont00001760: Facility Ontology

Medical Depot
type: Class
subclass of: Storage Facility
definition: A Storage Facility that is designed to store medical supplies.
ont00001760: Facility Ontology

Power Transmission Line
type: Class
subclass of: Product Transport Facility
definition: A Product Transport Facility that is designed to transmit electricity over distance via a system of above ground wires including their supports.
ont00001754: https://en.wikipedia.org/w/index.php
ont00001760: Facility Ontology

Water Tower
type: Class
subclass of: Storage Facility
definition: A Facility that is the bearer of functions realized in processes of storing water in an elevated container.
ont00001754: https://en.wikipedia.org/w/index.php
ont00001760: Facility Ontology

Command Post Facility
type: Class
subclass of: Military Facility
definition: A Military Facility that is designed to support the command and control of Military Operations or Forces.
ont00001754: http://www.dictionary.com/browse/command-post
ont00001760: Facility Ontology

Fossil Fuel Power Plant
type: Class
subclass of: Electric Power Station
definition: An Electric Power Station that is designed to convert fossil fuels (e.g. coal, natural gas, or petroleum) into electrical energy.
ont00001754: https://en.wikipedia.org/w/index.php
ont00001760: Facility Ontology

Forward Operations Base
type: Class
subclass of: Military Base
alternative label: Forward Operating Base
definition: A Military Base that is located relatively close to an offensive Area of Operations, is supported by the Base of Operations, and is designed to support local strategic objectives and tactical operations.
ont00001753: FOB
ont00001754: https://en.wikipedia.org/w/index.php
ont00001760: Facility Ontology

Synagogue
type: Class
subclass of: Religious Facility
definition: A Religious Facility that is designed for Judaic worship and prayer.
ont00001754: https://en.wikipedia.org/w/index.php
ont00001760: Facility Ontology

Pier
type: Class
subclass of: Transportation Facility
definition: A Transportation Facility that is designed to partially enclose a harbor and form a landing place for Watercraft.
ont00001754: https://en.wikipedia.org/w/index.php
ont00001760: Facility Ontology

Chemical Depot
type: Class
subclass of: Storage Facility
definition: A Storage Facility that is designed to store chemicals.
ont00001760: Facility Ontology

Factory
type: Class
subclass of: ont00000192
definition: A Facility that is designed for manufacturing or refining material products.
ont00001754: https://en.wikipedia.org/w/index.php
ont00001760: Facility Ontology

Stage
type: Class
subclass of: Entertainment Facility
definition: An Entertainment Facility that is designed to provide a space upon which entertaining performances or productions can occur.
ont00001754: https://en.wikipedia.org/wiki/Stage_(theatre)
ont00001760: Facility Ontology

Water Treatment Facility
type: Class
subclass of: ont00000192
definition: A Facility that is designed for making water more acceptable for a specific end-use.
ont00001754: https://en.wikipedia.org/w/index.php
ont00001760: Facility Ontology

Hydroelectric Power Plant
type: Class
subclass of: Electric Power Station
definition: An Electric Power Station that is designed to convert hydropower into electrical power.
ont00001754: https://en.wikipedia.org/w/index.php
ont00001760: Facility Ontology

Pipeline
type: Class
subclass of: Product Transport Facility
definition: A Product Transport Facility that is designed to transport goods or materials through a pipe.
ont00001754: https://en.wikipedia.org/w/index.php
ont00001760: Facility Ontology

Storage Facility
type: Class
subclass of: ont00000192
definition: A Facility that is designed to store materials or goods.
ont00001754: https://en.wikipedia.org/w/index.php
ont00001760: Facility Ontology

Wind Farm
type: Class
subclass of: Electric Power Station
definition: An Electric Power Station that is designed to convert the wind's kinetic energy into electrical power by means of wind turbines.
ont00001754: https://en.wikipedia.org/w/index.php
ont00001760: Facility Ontology

Decontamination Facility
type: Class
subclass of: Washing Facility
definition: A Washing Facility that is designed to wash personnel or equipment after (potential) contamination by radioactive, biological, or chemical material.
ont00001754: https://en.wikipedia.org/w/index.php
ont00001760: Facility Ontology

Post Office
type: Class
subclass of: Mailing Facility
definition: A Mailing Facility that is designed for serving customers of the national postal system.
ont00001754: https://en.wikipedia.org/w/index.php
ont00001760: Facility Ontology

Government Building
type: Class
subclass of: ont00000192
definition: A Facility that is designed for the administration of a community.
ont00001754: https://en.wikipedia.org/wiki/Administration_(government)
ont00001760: Facility Ontology

Reservoir
type: Class
subclass of: Storage Facility
definition: A Storage Facility that is designed to store water in a man-made open enclosure or area.
ont00001754: https://en.wikipedia.org/w/index.php
ont00001760: Facility Ontology

Military Facility
type: Class
subclass of: ont00000192
definition: A Facility that is designed to support a Military Force.
ont00001754: https://en.wikipedia.org/w/index.php
ont00001760: Facility Ontology

Electric Power Station
type: Class
subclass of: ont00000192
alternative label: Power Plant
definition: A Facility that is designed to generate electrical power.
ont00001754: https://en.wikipedia.org/w/index.php
ont00001760: Facility Ontology

Airport
type: Class
subclass of: Transportation Facility
definition: A Transportation Facility that is designed for launching, receiving, and housing Aircraft.
ont00001754: https://en.wikipedia.org/w/index.php
ont00001760: Facility Ontology

Petrochemical Refinery
type: Class
subclass of: Refinery
definition: A Refinery that is designed for refining crude oil, intermediate petroleum products, or synthetic petroleum into products of value.
ont00001754: https://en.wikipedia.org/w/index.php
ont00001760: Facility Ontology

Fort
type: Class
subclass of: Military Facility
definition: A Military Facility that is designed to support the defense of or solidification of rule over some Geospatial Region and its inhabitants.
ont00001754: https://en.wikipedia.org/w/index.php
ont00001760: Facility Ontology

Hospital
type: Class
subclass of: Healthcare Facility
definition: A Healthcare Facility that is designed to provide patient treatment with specialized staff and equipment.
ont00001754: https://en.wikipedia.org/w/index.php
ont00001760: Facility Ontology

Commercial Facility
type: Class
subclass of: ont00000192
definition: A Facility that is designed for buying and selling goods and services, especially on a large scale.
ont00001754: https://en.wikipedia.org/w/index.php
ont00001760: Facility Ontology

Landfill
type: Class
subclass of: Waste Management Facility
definition: A Waste Management Facility that is designed for disposing of waste by burial.
ont00001754: https://en.wikipedia.org/w/index.php
ont00001760: Facility Ontology

Terrorist Training Camp
type: Class
subclass of: Training Camp
definition: A Training Camp designed to teach students methods of terrorism.
ont00001754: https://en.wikipedia.org/w/index.php
ont00001760: Facility Ontology

Nuclear Storage Depot
type: Class
subclass of: Storage Facility
definition: A Storage Facility that is designed to store nuclear material.
ont00001760: Facility Ontology

Port
type: Class
subclass of: Transportation Facility
definition: A Transportation Facility that is designed to contain harbors for docking Watercraft and for transfering people or cargo to and from land.
ont00001754: https://en.wikipedia.org/w/index.php
ont00001760: Facility Ontology

Refinery
type: Class
subclass of: Factory
definition: A Factory that is designed for refining raw materials into products of value.
ont00001754: https://en.wikipedia.org/w/index.php
ont00001760: Facility Ontology

Maintenance Facility
type: Class
subclass of: ont00000192
definition: A Facility that is designed to be used to perform actions to maintain or improve the state of some property or equipment.
ont00001754: http://www.dictionary.com/browse/maintain
ont00001760: Facility Ontology

Financial Facility
type: Class
subclass of: ont00000192
definition: A Facility that is designed to support the management of money.
ont00001754: https://en.wikipedia.org/w/index.php
ont00001760: Facility Ontology

Military Headquarters Facility
type: Class
subclass of: Military Facility
definition: A Military Facility that is designed for military administration and coordination.
ont00001754: https://en.wikipedia.org/w/index.php
ont00001760: Facility Ontology

Sewage Treatment Facility
type: Class
subclass of: Waste Management Facility
definition: A Waste Management Facility that is designed for removing contaminants from wastewater, especially sewage.
ont00001754: https://en.wikipedia.org/w/index.php
ont00001760: Facility Ontology

Aircraft Manufacturing Facility
type: Class
subclass of: Factory
definition: A Factory that is designed to manufacture Aircraft.
ont00001754: https://en.wikipedia.org/w/index.php
ont00001760: Facility Ontology

Waste Management Facility
type: Class
subclass of: ont00000192
definition: A Facility that is designed for managing waste for some portion of the waste's existence.
ont00001754: https://en.wikipedia.org/w/index.php
ont00001760: Facility Ontology

Biological Depot
type: Class
subclass of: Storage Facility
definition: A Storage Facility that is designed to store biological agents.
ont00001760: Facility Ontology

School
type: Class
subclass of: Educational Facility
definition: An Education Facility that is designed to provide learning space and environments for teaching of students under the direction of teachers.
ont00001754: https://en.wikipedia.org/w/index.php
ont00001760: Facility Ontology

Gas Processing Facility
type: Class
subclass of: Refinery
definition: A Refinery that is designed for refining natural gas into products of value.
ont00001754: https://en.wikipedia.org/w/index.php
ont00001760: Facility Ontology

Washing Facility
type: Class
subclass of: ont00000192
definition: A Facility that is designed to wash personnel or equipment.
ont00001754: https://en.wikipedia.org/w/index.php
ont00001760: Facility Ontology

Farm
type: Class
subclass of: Agricultural Facility
definition: An Agricultural Facility that is designed to produce food and other crops.
ont00001754: https://en.wikipedia.org/w/index.php
ont00001760: Facility Ontology

Fire Station
type: Class
subclass of: Public Safety Facility
alternative label: Fire Hall
alternative label: Fire House
definition: A Public Safety Facility that is designed for the storage of firefighting apparatus.
ont00001754: https://en.wikipedia.org/w/index.php
ont00001760: Facility Ontology